{"text_format":"1","workbook":"xlsx","n_sheets":3,"sheets":["Notes","Game","Paramters"],"not_rendered":{"charts":1,"images":10,"macros":1,"external_links":0,"defined_names":37,"comments":0,"pivot_tables":0},"unopened":[],"bounds":{"document_bytes":16777216,"sheet_cells":100000,"rows_first":2000,"rows_last":500,"rows_between":2000,"halvings":0,"cell_chars":16384,"cell_head_chars":4096},"cells_cut":0,"cells_raw":0,"read":"whole","date_system":"1900"}

{"sheet":"Notes","index":0,"n_rows":22,"n_cols":2,"rows_kept":22,"cut":false,"hidden":false,"merged":[]}
["How to protect a student from dropping out game."]
[]
[null,"Yellow cells on the Game tab may be used to change inputs."]
[null,"The Roll Dice button is used to solicit an outcome. Outcomes depend on probability. Probabilities are shown in violet cells at the top."]
[null,"   A roll of the dice may result in graduation, or it may result in dropping out."]
[null,"   The more protection a student has from dropping out, the less likely will that outcome be."]
[null,"All students have a certain likelihood of dropping out each semester. (See the parameter tab for the probability.)"]
[null,"The longer in school, the more likely a drop out."]
[null,"The more developmental coursework is needed, the longer in school."]
[null,"The more a student studies, the better the grade and the faster accumulation of credits, speeding time to graduation."]
[null,"The more credits taken, the fewer hours it may be possible to study for each course."]
[null,"A week has only so many hours."]
[null,"The maximum credit load is determined by the number of hours left in the week to attend class."]
[]
[]
[null,"This workbook contains a few Visual Basic commands. If you get an error, save your parameters and restart. It's cranky."]
[]
[]
[null,"The parameters are partially based on actual LaGuardia data from 2012, and partially on simulation data that matched actual outcomes."]
[null,"12 semesters of probabilities can be found beginning in cell F100 on the Game tab. It's hidden only because of the complexity."]
[]
[null,"Acknowlegement: Sam Michalowski did the interviews and reporting on students who changed registration intensity that set up the theory for this work."]

{"sheet":"Game","index":1,"n_rows":379,"n_cols":27,"rows_kept":379,"cut":false,"hidden":false,"merged":[[306,5,311,5],[200,7,200,11],[201,7,201,10],[201,11,201,12],[166,7,166,10],[166,11,166,12],[184,7,184,11],[185,7,185,10],[185,11,185,12],[323,9,323,10],[107,8,107,11],[107,12,107,13],[165,7,165,11],[106,7,106,12]]}
["College Success Game"]
[null,"Results:"]
["Probability of dropping out before graduation",{"$f":"Game!N107","v":0.19754595250436158}]
["Expected lifetime earnings",{"$f":"Game!M108","v":2106568.6832118863}]
["Probable graduation semester",{"$f":"MATCH(gradcred,Game!H103:S103,0)","v":4}]
["Percentage of courses passed",{"$f":"(minpass+(MIN(Game!I119,maxstudy)/maxstudy)*(maxpass-minpass))","v":0.9},null,"FOR ANY GIVEN STUDENT, THIS MEANS…"]
[]
["Input","Input",null,"Roll the dice to see what the probabilities actually mean!"]
["What was your HS GPA?",4]
["Into which developmental course levels did you place?"]
[null,null,null,{"$f":"Game!S303&\" in semester \"&TEXT(IFERROR(MATCH(\"Continue\",Game!H303:S303,1),0)+1,0)","v":"Graduation in semester 4"},null,null,null,false]
[null,null,null,"(Actual results may vary.)",null,null,null,false]
[null,null,null,null,null,null,null,false]
[null,null,null,null,null,null,null,false]
[null,null,null,"Notes:",null,null,null,false]
["How many hours do you sleep each night?",6,null,{"$f":"\"Fewer than \"&minsleep&\" lowers drop-out protection\"","v":"Fewer than 6 lowers drop-out protection"},null,null,null,false,null,null,6]
["How long do you need each day to eat, dress, get ready?",4,null,null,null,null,null,false,null,null,4]
["How many hours do you spend commuting each weekday?",2,null,null,null,null,null,false,null,null,2]
["How much time do you spend with your family each day?",0,null,null,null,null,null,null,null,null,0]
["How many hours will you work each week?",0,null,null,null,null,null,null,null,null,0]
["How many nights each week will you go out?",0,null,{"$f":"\"Each night uses up \"&party&\" hours\"","v":"Each night uses up 6 hours"},null,null,null,null,null,null,0]
["How many hours per week will you engage in support activities?",10,null,{"$f":"\"Maximum of \"&maxsup&\" (seeing advisors, math lab, etc.)\"","v":"Maximum of 10 (seeing advisors, math lab, etc.)"},null,null,null,null,null,null,10]
["How many hours per week will you study?",54,null,{"$f":"\"Probability of passing with 0 hours \"& minpass*100&\"%\"","v":"Probability of passing with 0 hours 63%"},null,null,null,null,null,null,54]
[null,null,null,{"$f":"\"Probability of passing with \"&B25*3&\" hours: \"&maxpass*100&\"%\"","v":"Probability of passing with 54 hours: 90%"}]
["Planned credit load",18,{"$f":"ROUNDDOWN((Corcred*(Game!$G$113-Game!H116*7-Game!H117*7-Game!H120-Game!H121-Game!$H$126-B23))/(Corhrs),0)","v":18},"= current maximum credit load",null,null,null,null,null,null,18]
["Available hours per week:",{"$f":"H114","v":0}]
[]
[]
[]
[]
[]
[]
[]
[]
[]
[]
[]
[]
[]
[]
[]
[]
[]
[]
[]
[]
[]
[]
[]
[]
[]
[]
[]
[]
[]
[]
[]
[]
[]
[]
[]
[]
[]
[]
[]
[]
[]
[]
[]
[]
[]
[]
[]
[]
[]
[]
[]
[]
[]
[]
[]
[]
[]
[]
[]
[]
[]
[]
[]
[]
[]
[]
[]
[]
[]
[]
[]
[]
[]
[null,null,null,null,null,"A Model of the Path to Graduation--Life Happens, Some Students Have Better Protection Against It"]
[null,null,null,null,null,null,"Initial",{"$f":"\"Term \"& TEXT(H154,Paramters!$C$1)","v":"Term 1"},{"$f":"\"Term \"& TEXT(I154,Paramters!$C$1)","v":"Term 2"},{"$f":"\"Term \"& TEXT(J154,Paramters!$C$1)","v":"Term 3"},{"$f":"\"Term \"& TEXT(K154,Paramters!$C$1)","v":"Term 4"},{"$f":"\"Term \"& TEXT(L154,Paramters!$C$1)","v":"Term 5"},{"$f":"\"Term \"& TEXT(M154,Paramters!$C$1)","v":"Term 6"},{"$f":"\"Term \"& TEXT(N154,Paramters!$C$1)","v":"Term 7"},{"$f":"\"Term \"& TEXT(O154,Paramters!$C$1)","v":"Term 8"},{"$f":"\"Term \"& TEXT(P154,Paramters!$C$1)","v":"Term 9"},{"$f":"\"Term \"& TEXT(Q154,Paramters!$C$1)","v":"Term 10"},{"$f":"\"Term \"& TEXT(R154,Paramters!$C$1)","v":"Term 11"},{"$f":"\"Term \"& TEXT(S154,Paramters!$C$1)","v":"Term 12"}]
[null,null,null,null,null,"Graduation semester, if any",null,{"$f":"IF(H103>=gradcred,\"Graduation\",\"\")","v":""},"","","Graduation","Graduation","Graduation","Graduation","Graduation","Graduation","Graduation","Graduation","Graduation"]
[null,null,null,null,null,"Credits toward graduation, term end",{"$f":"-G111*3","v":0},{"$f":"ROUNDDOWN(IF(G103+(H118*Corcred)*(minpass+(MIN(H119,maxstudy)/maxstudy)*(maxpass-minpass))-IF(AND(H122=1,G103>0),majloss*G103,0)>=gradcred,gradcred,G103+(H118*Corcred)*(minpass+(MIN(H119,maxstudy)/maxstudy)*(maxpass-minpass))-IF(AND(H122=1,G103>0),majloss*G103,0)),0)","v":16},32,48,60,60,60,60,60,60,60,60,60]
[null,null,null,null,null,"Protection",null,{"$f":"(1-((minprot+(maxprot-H134))/maxprot))^profac","v":0.41770643360935739},0.71980676948463718,0.84359843533857093,0.92888310360781357,0.9783178815603143,0.9783178815603143,0.9783178815603143,0.9783178815603143,0.9783178815603143,0.9783178815603143,0.9783178815603143,0.9783178815603143,null,{"$f":"Game!H11","v":false}]
[null,null,null,null,null,{"$f":"F137","v":"Cumulative probability of dropping out"},null,{"$f":"H137","v":0.11645871327812851},0.16372962491806592,0.1875817620125389,0.19754595250436158,0.19754595250436158,0.19754595250436158,0.19754595250436158,0.19754595250436158,0.19754595250436158,0.19754595250436158,0.19754595250436158,0.19754595250436158,null,{"$f":"Game!H12","v":false}]
[null,null,null,null,null,null,null,null,null,null,null,null,null,null,null,null,null,null,null,null,{"$f":"Game!H13","v":false}]
[null,null,null,null,null,null,null,"Cumulative probability of dropping out:",null,null,null,null,null,{"$f":"S137","v":0.19754595250436158},null,null,null,null,null,null,{"$f":"Game!H14","v":false}]
[null,null,null,null,null,null,null,null,"Expected lifetime earnings:",null,null,null,{"$f":"X161","v":2106568.6832118863},null,null,null,null,null,null,null,{"$f":"Game!H15","v":false}]
[null,null,null,null,null,null,null,null,null,null,null,null,null,null,null,null,null,null,null,null,{"$f":"Game!H16","v":false}]
[null,null,null,null,null,null,null,null,null,null,null,null,null,null,null,null,null,null,null,null,{"$f":"Game!H17","v":false}]
[null,null,null,null,null,{"$f":"\"Developmental Courses Needed (0-\"&maxdev&\")\"","v":"Developmental Courses Needed (0-7)"},{"$f":"U114","v":0},null,null,null,null,null,null,null,null,null,null,null,null,null,{"$f":"Game!H18","v":false}]
[null,null,null,null,null,"High School Performance (0.00 - 4.00)",{"$f":"Game!B9","v":4}]
[null,null,null,null,null,"Time Distribution--Total Hours per week",{"$f":"7*24","v":168}]
[null,null,null,null,null,"  Fun, hours per week (computed)",null,{"$f":"IF(($G$113-H116*7-H117*7-H118*(Corhrs+Corcred*(H119))-H120-H121-$H$126)<0,\"Error\",($G$113-H116*7-H117*7-H118*(Corhrs+Corcred*(H119))-H120-H121)-$H$126)","v":0},0,0,0,0,0,0,0,0,0,0,0,null,{"$f":"IF(U111,3,IF(U110,2,IF(OR(U109,U104),1,0)))+IF(U105,2,IF(U106,1,0))+IF(U107,2,IF(U108,1,0))","v":0},2]
[null,null,null,null,null,"Input variables: "]
[null,null,null,null,null,"  Sleep, eat, commute: hours per day",null,{"$f":"H123+H124+H125","v":11.428571428571429},{"$f":"H116","v":11.428571428571429},11.428571428571429,11.428571428571429,11.428571428571429,11.428571428571429,11.428571428571429,11.428571428571429,11.428571428571429,11.428571428571429,11.428571428571429,11.428571428571429]
[null,null,null,null,null,"  Family: hours per day",null,{"$f":"Game!B19","v":0},{"$f":"H117","v":0},0,0,0,0,0,0,0,0,0,0,null,null,null,null,null,null,{"$f":"IF(AA118<Y118,\"Error Make Last Sem Higher\",\"\")","v":""}]
[null,null,null,null,null,{"$f":"\"  Courses (\"&Corcred&\" credits/course)\"","v":"  Courses (3 credits/course)"},null,{"$f":"Game!B25/Corcred","v":6},{"$f":"H118","v":6},6,6,6,6,6,6,6,6,6,6,null,null,null,null,null,1,null,8]
[null,null,null,null,null,{"$f":"\"  Hours of study/course credit (max. \"&maxstudy&\")\"","v":"  Hours of study/course credit (max. 3)"},null,{"$f":"H127","v":3},{"$f":"H119","v":3},3,3,3,3,3,3,3,3,3,3]
[null,null,null,null,null,{"$f":"\"  Support activities: hours per week (max. \"&maxsup&\")\"","v":"  Support activities: hours per week (max. 10)"},null,{"$f":"Game!B22","v":10},{"$f":"H120","v":10},10,10,10,10,10,10,10,10,10,10,null,null,null,"  Courses (3 credits/course)"]
{"$rows_left_out":260}
{"sheet":"Paramters","index":2,"n_rows":45,"n_cols":11,"rows_kept":45,"cut":false,"hidden":false,"merged":[]}
[null,"Parameters",0,null,null,null,"Test Status","Need","%","Num."]
["badfac","Probability of a bad thing in life",0.2,"The probability of something bad enough happening each semester that without sufficient protection the student will leave.",null,null,"Passed All",0,0.25,693,{"$f":"I2*H2","v":0}]
["Supfac","Support Factor (protection points per hour)",2,"This is multiplied times the hours spent in support activities to increase protection points.",null,null,"Passed Two",1,0.28999999999999998,811,{"$f":"I3*H3","v":0.28999999999999998}]
["credfac","Credit factor",1,"This is multiplied times the number of credits earned to increase protection points.",null,null,"Passed One",2,0.28000000000000003,807,{"$f":"I4*H4","v":0.56000000000000005}]
["Grdfac","Grades additional multiplier",10,"This is the % added for each hour of study for each course in the increase to protection points.",null,null,"Passed None",3,0.18,517,0.54]
["minpass","Minimum probability of  passing course with 0 hours of study",0.63,"If good grades are turned off, this is the proportion of credits earned.",null,null,null,null,null,{"$f":"SUM(J2:J5)","v":2828},{"$f":"SUM(K2:K5)","v":1.3900000000000001}]
["maxpass",{"$f":"\"Maximum probability of passing course with \"&maxstudy&\" hours of study\"","v":"Maximum probability of passing course with 3 hours of study"},0.9,"If good grades are turned on, this is the proportion of credits earned."]
["gradcred","Credits for graduation",60]
["majloss","% loss of earned credits for major change",0.2,"This is the proportion of accumulated credits lost whenever a major is changed."]
["Corcred","Credits per course",3]
["Corhrs","Course hours per week",4,"The cost of each course in hours per week."]
["minsleep","Minimum hours of sleep, eat & commute before protection penalty",6]
["maxstudy","Maximum number of hours that study is useful per course credit",3]
["maxdev","Developmental Courses Needed Max",7]
[null,"High School Performance Min",0]
["minprot","Minimum Protection Points",{"$f":"((maxdev-C14)*devfac+C15*hsgrdfac)+1","v":1}]
["maxprot","Maximum Protection points",{"$f":"maxdev*devfac+4*hsgrdfac+2+12*(maxsup*Supfac)+maxstudy*gradcred*Grdfac+gradcred*credfac","v":2168},{"$f":"hsgrdfac","v":6}]
[null,"Sleep min.",0]
["maxsup","Support activities, max.",10]
[null,"Good grades, max.",1]
[null,"Courses, max.",8]
["sleepfac","The impact on points for each hour of sleep below minimum.",1]
["devfac","The weight per dev course needed in negative protection points",6]
["hsgrdfac","The weight per point in high school grade point to give to protection",6]
["profac","protection curve exponential factor",0.25]
[1,"Continue"]
[2,"Early Transfer"]
[3,"Drop Out"]
[4,"Graduation"]
["somecol","Annual earnings, some college",46168,{"$f":"somecol*career","v":1985224},"*"]
["aa","Annual earnings, associate's",48534,{"$f":"aa*career","v":2086962},"*"]
["ba","Annual earnings, BA",71044,{"$f":"ba*career","v":3054892},"*"]
["aatran","Prob of AA grad transferring",0.55000000000000004]
["aabagrad","Prob of AA grad transfer grad BA",0.54]
["earlybagrad","Prob of early transfer grad BA",{"$f":"C34*(1-0.12)","v":0.47520000000000001}]
["gradyrba","Number of years to BA degree post grd",3]
["tranyrba","Number of years to BA degree early trn",4]
["career","Number of earning years at entry",43]
[null,null,null,"Fun is the number of hours remaining in the week after all else is deducted. If it is negative, an error occurs."]
[null,null,null,"Each developmental course adds three credits toward graduation (by starting the accumulation in the negative.)"]
[null,null,null,"The probability of leaving does not increase after the semester when the student might have graduated."]
["Party","Hours spent in one night's partying",6]
[]
[null,"*Source: Bureau of the Census; Bureau of Labor Statistics"]
[null,"http://www.census.gov/hhes/cpstables/032009/perinc/new03-010.htm"]